0

I am using the CodeLite IDE. I compiled the following program using CodeLite (It is a C++ program):

#include <iostream.h>
int main()
{
cout << "Hello World\n";
return (0);
}

It returns this message:

g++ -c "/home/keagan/.coding-work/Hello/printamessage.cc" -g -o ./Debug/printamessage.o "-I." "-I."
/home/keagan/.coding-work/Hello/printamessage.cc:1:23: error: iostream.h: No such file or directory
/home/keagan/.coding-work/Hello/printamessage.cc: In function ‘int main()’:
/home/keagan/.coding-work/Hello/printamessage.cc:4: error: ‘cout’ was not declared in this scope
make[1]: *** [Debug/printamessage.o] Error 1
make: *** [All] Error 2

Anybody have any idea how to fix this? It seems to be a library issue...

--thanks, techningeer

2
Contributors
2
Replies
3
Views
6 Years
Discussion Span
Last Post by techningeer
0

#include <iostream> Drop the .h
Oh, and use either

using std::cout;

or

std::cout << "...";

or you will get more errors related to sytax.

Edited by L7Sqr: n/a

This question has already been answered. Start a new discussion instead.
Have something to contribute to this discussion? Please be thoughtful, detailed and courteous, and be sure to adhere to our posting rules.