1

Mandrake Linux 9.2
Kernel sources are installed
2.4.22-10 kernel
Open log with Wordpad or Gedit

Attachments
[root@localhost nforce]# make
make -C  nvnet
make[1]: Entering directory `/home/epro/Nforcesource/nforce/nvnet'
make[1]: Nothing to be done for `all'.
make[1]: Leaving directory `/home/epro/Nforcesource/nforce/nvnet'
make -C  nvaudio
make[1]: Entering directory `/home/epro/Nforcesource/nforce/nvaudio'
make nvaudio.o
make[2]: Entering directory `/home/epro/Nforcesource/nforce/nvaudio'
cc -D__KERNEL__  -I/lib/modules/2.4.22-10mdk/build/include -Wall -Wstrict-protot
ypes -O -fno-strict-aliasing -mpreferred-stack-boundary=2 -march=i686 -falign-fu
nctions=4 -DMODULE  -DMODVERSIONS -include /lib/modules/2.4.22-10mdk/build/inclu
de/linux/modversions.h   -c -o nvrec.o nvrec.c
In file included from nvhw.h:14,
                 from nvrec.c:12:
/lib/modules/2.4.22-10mdk/build/include/linux/ioport.h:83:24: exponent has no di
gits
In file included from nvhw.h:14,
                 from nvrec.c:12:
/lib/modules/2.4.22-10mdk/build/include/linux/ioport.h:83: error: syntax error b
efore numeric constant
/lib/modules/2.4.22-10mdk/build/include/linux/ioport.h:83: warning: function dec
laration isn't a prototype
/lib/modules/2.4.22-10mdk/build/include/linux/ioport.h:84:24: exponent has no di
gits
/lib/modules/2.4.22-10mdk/build/include/linux/ioport.h:84: error: syntax error b
efore numeric constant
/lib/modules/2.4.22-10mdk/build/include/linux/ioport.h:84: warning: function dec
laration isn't a prototype
/lib/modules/2.4.22-10mdk/build/include/linux/ioport.h:88: error: `check_resourc
e_R_ver_str' declared as function returning a function
/lib/modules/2.4.22-10mdk/build/include/linux/ioport.h:88: warning: parameter na
mes (without types) in function declaration
/lib/modules/2.4.22-10mdk/build/include/linux/ioport.h:89:12: invalid suffix "cf
b" on integer constant
/lib/modules/2.4.22-10mdk/build/include/linux/ioport.h:89: error: syntax error b
efore numeric constant
/lib/modules/2.4.22-10mdk/build/include/linux/ioport.h:89: error: `request_resou
rce_R_ver_str' declared as function returning a function
/lib/modules/2.4.22-10mdk/build/include/linux/ioport.h:89: warning: function dec
laration isn't a prototype
/lib/modules/2.4.22-10mdk/build/include/linux/ioport.h:90: error: syntax error b
efore numeric constant
/lib/modules/2.4.22-10mdk/build/include/linux/ioport.h:90: error: `release_resou
rce_R_ver_str' declared as function returning a function
/lib/modules/2.4.22-10mdk/build/include/linux/ioport.h:90: warning: function dec
laration isn't a prototype
/lib/modules/2.4.22-10mdk/build/include/linux/ioport.h:97: error: `allocate_reso
urce_R_ver_str' declared as function returning a function
/lib/modules/2.4.22-10mdk/build/include/linux/ioport.h:97: warning: parameter na
mes (without types) in function declaration
/lib/modules/2.4.22-10mdk/build/include/linux/ioport.h:103:26: invalid suffix "a
1a4f09" on integer constant
/lib/modules/2.4.22-10mdk/build/include/linux/ioport.h:103: error: syntax error
before numeric constant
/lib/modules/2.4.22-10mdk/build/include/linux/ioport.h:103: error: `__request_re
gion_R_ver_str' declared as function returning a function
/lib/modules/2.4.22-10mdk/build/include/linux/ioport.h:103: warning: function de
claration isn't a prototype
/lib/modules/2.4.22-10mdk/build/include/linux/ioport.h:111: error: `__check_regi
on_R_ver_str' declared as function returning a function
/lib/modules/2.4.22-10mdk/build/include/linux/ioport.h:111: warning: parameter n
ames (without types) in function declaration
/lib/modules/2.4.22-10mdk/build/include/linux/ioport.h:112: error: `__release_re
gion_R_ver_str' declared as function returning a function
/lib/modules/2.4.22-10mdk/build/include/linux/ioport.h:112: warning: parameter n
ames (without types) in function declaration
/lib/modules/2.4.22-10mdk/build/include/linux/ioport.h:118:13: invalid suffix "a
5a2280" on integer constant
/lib/modules/2.4.22-10mdk/build/include/linux/ioport.h:118: error: syntax error
before numeric constant
/lib/modules/2.4.22-10mdk/build/include/linux/ioport.h:118: error: `autoirq_setu
p_R_ver_str' declared as function returning a function
/lib/modules/2.4.22-10mdk/build/include/linux/ioport.h:118: warning: function de
claration isn't a prototype
/lib/modules/2.4.22-10mdk/build/include/linux/ioport.h:119:12: invalid suffix "c                              53" on integer constant
/lib/modules/2.4.22-10mdk/build/include/linux/ioport.h:119: error: syntax error                               before numeric constant
/lib/modules/2.4.22-10mdk/build/include/linux/ioport.h:119: error: `autoirq_repo                              rt_R_ver_str' declared as function returning a function
/lib/modules/2.4.22-10mdk/build/include/linux/ioport.h:119: warning: function de                              claration isn't a prototype
In file included from nvhw.h:15,
                 from nvrec.c:12:
/lib/modules/2.4.22-10mdk/build/include/linux/sched.h:6:22: invalid suffix "b16c                              344" on integer constant
In file included from nvhw.h:15,
                 from nvrec.c:12:
/lib/modules/2.4.22-10mdk/build/include/linux/sched.h:6: error: syntax error bef                              ore numeric constant
/lib/modules/2.4.22-10mdk/build/include/linux/sched.h:6: warning: function decla                              ration isn't a prototype
make[2]: *** [nvrec.o] Error 1
make[2]: Leaving directory `/home/epro/Nforcesource/nforce/nvaudio'
make[1]: *** [all] Error 2
make[1]: Leaving directory `/home/epro/Nforcesource/nforce/nvaudio'
make: *** [nvaudio_make] Error 2
[root@localhost nforce]#
4
Contributors
11
Replies
12
Views
13 Years
Discussion Span
Last Post by i686-linux
1

Mandrake Linux 9.2
Kernel sources are installed
2.4.22-10 kernel
Open log with Wordpad or Gedit

What version of XFree86 you running? You may not have the correct binaries needed for nvidia compile to work....

0

Whatever version comes with Mandrake 9.2
This doesnt have to do with my video card drivers though!
its my sound card drivers im tryign to install!

0

It has to do with your compiling your video card driver though...gcc is what it uses to compile the nvidia driver

0

mobo? Nforce 2 audio codec interface is my souind card

1

I don't have much Mandrake experience, but you may want to upgrade your kernel to 2.4.25. Many issues have been fixed since the 2.4.22 release ranging from driver issues, to exploit fixes. I myself have had issues compiling kernel drivers, and an update to 2.4.25 took care of my build issues. (I was previously using 2.4.22 also, but for slackware) Compiling a kernel can be a bit troublesome the first time, but lots of help and documentation is available for this. Doesn't mandrake even provide an update tool for this?

As a side note, I highly recommend that anyone running a kernel prior to 2.4.25 upgrade soon!

This topic has been dead for over six months. Start a new discussion instead.
Have something to contribute to this discussion? Please be thoughtful, detailed and courteous, and be sure to adhere to our posting rules.